Linguistics
type: Class
comment: Includes Old Persian, Pali, and Sanskrit.
subclass of: ArtsAndHumanities
disjoint with: Religion
disjoint with: Philosophy
disjoint with: PerformingArts
disjoint with: Music
disjoint with: LanguageAndLiterature
disjoint with: FineArts

RomanceLanguagesAndLiteratures
type: Class
disjoint with: EastAsianLanguagesAndLiteratures
comment: Includes Romanian.
disjoint with: EnglishLanguageAndLiterature
disjoint with: SouthAsianLanguagesAndLiteratures
disjoint with: GermanicLanguagesAndLiteratures
disjoint with: ClassicalLanguagesAndLiteratures
disjoint with: NearEasternLanguagesAndLiteratures
subclass of: LanguageAndLiterature
disjoint with: GreekLanguageAndLiterature
disjoint with: SlavicLanguagesAndLiteratures
disjoint with: SoutheastAsianLanguagesAndLiteratures
disjoint with: HebrewLanguageAndLiterature
disjoint with: AfricanLanguagesAndLiteratures

SouthAsianLanguagesAndLiteratures
type: Class
disjoint with: GermanicLanguagesAndLiteratures
disjoint with: EastAsianLanguagesAndLiteratures
comment: Includes Hindi and Tamil.
disjoint with: RomanceLanguagesAndLiteratures
disjoint with: EnglishLanguageAndLiterature
disjoint with: SoutheastAsianLanguagesAndLiteratures
disjoint with: GreekLanguageAndLiterature
disjoint with: NearEasternLanguagesAndLiteratures
disjoint with: AfricanLanguagesAndLiteratures
subclass of: LanguageAndLiterature
disjoint with: SlavicLanguagesAndLiteratures
disjoint with: ClassicalLanguagesAndLiteratures
disjoint with: HebrewLanguageAndLiterature

AfricanLanguagesAndLiteratures
type: Class
disjoint with: EastAsianLanguagesAndLiteratures
disjoint with: ClassicalLanguagesAndLiteratures
subclass of: LanguageAndLiterature
comment: Includes Afrikaans, Amharic, Kikuyu, Kiswahili, Sesotho, Shona, TIgrinya, Twi, Yoruba, and Zulu.
disjoint with: RomanceLanguagesAndLiteratures
disjoint with: NearEasternLanguagesAndLiteratures
disjoint with: SoutheastAsianLanguagesAndLiteratures
disjoint with: EnglishLanguageAndLiterature
disjoint with: GreekLanguageAndLiterature
disjoint with: SouthAsianLanguagesAndLiteratures
disjoint with: GermanicLanguagesAndLiteratures
disjoint with: SlavicLanguagesAndLiteratures
disjoint with: HebrewLanguageAndLiterature

NearEasternLanguagesAndLiteratures
type: Class
subclass of: LanguageAndLiterature
disjoint with: SoutheastAsianLanguagesAndLiteratures
disjoint with: EnglishLanguageAndLiterature
disjoint with: GreekLanguageAndLiterature
disjoint with: AfricanLanguagesAndLiteratures
disjoint with: SlavicLanguagesAndLiteratures
disjoint with: HebrewLanguageAndLiterature
disjoint with: RomanceLanguagesAndLiteratures
disjoint with: GermanicLanguagesAndLiteratures
disjoint with: EastAsianLanguagesAndLiteratures
comment: Includes Akkadian, Aramaic, Coptic, Egyptian, HIttite, Persian, Sumerian, Syriac, Turkish, and Ugaritic.
disjoint with: ClassicalLanguagesAndLiteratures
disjoint with: SouthAsianLanguagesAndLiteratures

SlavicLanguagesAndLiteratures
type: Class
disjoint with: GermanicLanguagesAndLiteratures
disjoint with: SouthAsianLanguagesAndLiteratures
comment: Includes Czech, Polish, and Serbian/Croatian.
subclass of: LanguageAndLiterature
disjoint with: SoutheastAsianLanguagesAndLiteratures
disjoint with: ClassicalLanguagesAndLiteratures
disjoint with: RomanceLanguagesAndLiteratures
disjoint with: NearEasternLanguagesAndLiteratures
disjoint with: HebrewLanguageAndLiterature
disjoint with: EastAsianLanguagesAndLiteratures
disjoint with: AfricanLanguagesAndLiteratures
disjoint with: GreekLanguageAndLiterature
disjoint with: EnglishLanguageAndLiterature

GermanLanguageAndLiterature
type: Class
disjoint with: ScandinavianLanguagesAndLiteratures
subclass of: GermanicLanguagesAndLiteratures
comment: Includes Yiddish.